View Issue Details
| ID | Project | Category | View Status | Date Submitted | Last Update |
|---|---|---|---|---|---|
| 0001207 | Ecere SDK | buildsystem | public | 2018-09-26 10:51 | 2018-09-27 11:25 |
| Reporter | wolfi | Assigned To | |||
| Priority | normal | Severity | minor | Reproducibility | have not tried |
| Status | new | Resolution | open | ||
| Platform | x86_64:linux | OS | openSUSE | OS Version | - |
| Summary | 0001207: Cannot finish building on OpenSuse, error: lvalue required as left operand of assignment _nc_ESCDELAY() = 0; | ||||
| Description | ~/ecere-sdk> make Bootstrapping eC compiling tools... Building ecere... Building ec... Building ecp... Building ecc... Building ecs... All done! Building 2nd stage ecere... obj/release.linux/NCursesInterface.c: In function ‘__ecereMethod___ecereNameSpace__ecere__gui__drivers__NCursesInterface_Initialize’: obj/release.linux/NCursesInterface.c:4119:16: error: lvalue required as left operand of assignment _nc_ESCDELAY() = 0; ^ make[1]: *** [Makefile:1878: obj/release.linux/NCursesInterface.o] Error 1 make: *** [Makefile:209: ecere] Error 2 | ||||
| Tags | No tags attached. | ||||